Nanchang-n
type: LexicalEntry
canonical form: Nanchang
sense: 08745639-n
part of speech: noun

Nan-chang-n
type: LexicalEntry
canonical form: Nan-chang
sense: 08745639-n
part of speech: noun

08745639-n
type: LexicalConcept
in scheme: en-word.net
definition: a walled city in southeastern China on the Gan Jiang
ili: i82756
lexfile: noun.location
part of speech: noun
instance hypernym: 08542298-n