Nairobi-n
type: LexicalEntry
canonical form: Nairobi
sense: 08948355-n
part of speech: noun

capital of Kenya-n
type: LexicalEntry
canonical form: capital of Kenya
sense: 08948355-n
part of speech: noun

08948355-n
type: LexicalConcept
in scheme: en-word.net
definition: the capital and largest city of Kenya; a center for tourist safaris
ili: i83637
lexfile: noun.location
part of speech: noun
instance hypernym: 08709407-n