Perm-n
type: LexicalEntry
canonical form: Perm
sense: 09031742-n
part of speech: noun

Molotov-n
type: LexicalEntry
canonical form: Molotov
sense: 09031742-n
part of speech: noun
sense: 11204917-n

09031742-n
type: LexicalConcept
in scheme: en-word.net
definition: the administrative center of Perm Krai, Russia, located on the banks of the Kama River in the European part of Russia near the Ural Mountains
ili: i84012
lexfile: noun.location
part of speech: noun
instance hypernym: 08542298-n

Vyacheslav Molotov-n
type: LexicalEntry
canonical form: Vyacheslav Molotov
sense: 11204917-n
part of speech: noun

Vyacheslav Mikhailovich Molotov-n
type: LexicalEntry
canonical form: Vyacheslav Mikhailovich Molotov
sense: 11204917-n
part of speech: noun

11204917-n
type: LexicalConcept
in scheme: en-word.net
definition: Soviet statesman (1890-1986)
ili: i96280
lexfile: noun.person
part of speech: noun
instance hypernym: 10669601-n