Mexicali-n
type: LexicalEntry
canonical form: Mexicali
sense: 08761938-n
part of speech: noun

08761938-n
type: LexicalConcept
in scheme: en-word.net
definition: a city in northwestern Mexico near the California border
ili: i82836
lexfile: noun.location
part of speech: noun
instance hypernym: 08542298-n