Chevalier-n
type: LexicalEntry
canonical form: Chevalier
sense: 10915301-n
part of speech: noun

Maurice Chevalier-n
type: LexicalEntry
canonical form: Maurice Chevalier
sense: 10915301-n
part of speech: noun

10915301-n
type: LexicalConcept
in scheme: en-word.net
definition: French actor and cabaret singer (1888-1972)
ili: i94714
lexfile: noun.person
part of speech: noun
instance hypernym: 09784701-n
instance hypernym: 10619214-n