Maui-n
type: LexicalEntry
canonical form: Maui
sense: 09102671-n
part of speech: noun

Maui Island-n
type: LexicalEntry
canonical form: Maui Island
sense: 09102671-n
part of speech: noun

09102671-n
type: LexicalConcept
in scheme: en-word.net
definition: the second largest of the Hawaiian Islands
ili: i84336
lexfile: noun.location
part of speech: noun
instance hypernym: 09339360-n