Matterhorn-n
type: LexicalEntry
canonical form: Matterhorn
sense: 09372089-n
part of speech: noun

09372089-n
type: LexicalConcept
in scheme: en-word.net
definition: a mountain in the Alps on the border between Switzerland and Italy (14,780 feet high); noted for its distinctive shape
ili: i85759
lexfile: noun.object
part of speech: noun
instance hypernym: 09383019-n