Massachuset-n
type: LexicalEntry
canonical form: Massachuset
sense: 06923415-n
part of speech: noun
sense: 09680078-n

Massachusetts-n
type: LexicalEntry
canonical form: Massachusetts
sense: 06923415-n
part of speech: noun
sense: 09680078-n

Massachusetts language-n
type: LexicalEntry
canonical form: Massachusetts language
sense: 06923415-n
part of speech: noun

Massachuset language-n
type: LexicalEntry
canonical form: Massachuset language
sense: 06923415-n
part of speech: noun

06923415-n
type: LexicalConcept
in scheme: en-word.net
definition: the Algonquian language of the Massachuset
ili: i72834
lexfile: noun.communication
part of speech: noun
hypernym: 06919747-n

09680078-n
type: LexicalConcept
in scheme: en-word.net
definition: a member of the Algonquian people who formerly lived around Massachusetts Bay
ili: i87392
lexfile: noun.person
part of speech: noun
hypernym: 09666446-n