Maldives-n
type: LexicalEntry
canonical form: Maldives
sense: 08987406-n
part of speech: noun
sense: 08987602-n

Maldive Islands-n
type: LexicalEntry
canonical form: Maldive Islands
sense: 08987406-n
part of speech: noun

08987406-n
type: LexicalConcept
in scheme: en-word.net
definition: a group of about 1,200 small coral islands (about 220 inhabited) in the Indian ocean
ili: i83810
lexfile: noun.location
part of speech: noun
instance hypernym: 09339360-n
mero part: 08987602-n

Republic of Maldives-n
type: LexicalEntry
canonical form: Republic of Maldives
sense: 08987602-n
part of speech: noun

08987602-n
type: LexicalConcept
in scheme: en-word.net
definition: a republic on the Maldive Islands; achieved independence from the United Kingdom in 1965
ili: i83811
lexfile: noun.location
part of speech: noun
instance hypernym: 08562388-n
mero member: 09741555-n
mero part: 08987826-n