Locke-n
type: LexicalEntry
canonical form: Locke
sense: 11156788-n
part of speech: noun

John Locke-n
type: LexicalEntry
canonical form: John Locke
sense: 11156788-n
part of speech: noun

11156788-n
type: LexicalConcept
in scheme: en-word.net
definition: English empiricist philosopher who believed that all knowledge is derived from sensory experience (1632-1704)
ili: i95997
lexfile: noun.person
part of speech: noun
instance hypernym: 10443334-n