Hellman-n
type: LexicalEntry
canonical form: Hellman
sense: 11059184-n
part of speech: noun

Lillian Hellman-n
type: LexicalEntry
canonical form: Lillian Hellman
sense: 11059184-n
part of speech: noun

11059184-n
type: LexicalConcept
in scheme: en-word.net
definition: United States playwright; her plays were often indictments of injustice (1905-1984)
ili: i95472
lexfile: noun.person
part of speech: noun
instance hypernym: 10050002-n