Robert Edwin Lee-n
type: LexicalEntry
canonical form: Robert Edwin Lee
sense: 11143580-n
part of speech: noun

Lee-n
type: LexicalEntry
canonical form: Lee
sense: 11143580-n
part of speech: noun
sense: 11143752-n
sense: 11143884-n
sense: 11144078-n
sense: 11144290-n
sense: 11144462-n
sense: 11144637-n

Robert E. Lee-n
type: LexicalEntry
canonical form: Robert E. Lee
sense: 11143580-n
part of speech: noun

Robert Edward Lee-n
type: LexicalEntry
canonical form: Robert Edward Lee
sense: 11143580-n
part of speech: noun

11143580-n
type: LexicalConcept
in scheme: en-word.net
definition: American general who led the Confederate Armies in the American Civil War (1807-1870)
ili: i95924
lexfile: noun.person
part of speech: noun
instance hypernym: 10143381-n

Henry Lee III-n
type: LexicalEntry
canonical form: Henry Lee III
sense: 11143752-n
part of speech: noun

Henry Lee-n
type: LexicalEntry
canonical form: Henry Lee
sense: 11143752-n
part of speech: noun

Lighthorse Harry Lee-n
type: LexicalEntry
canonical form: Lighthorse Harry Lee
sense: 11143752-n
part of speech: noun

11143752-n
type: LexicalConcept
in scheme: en-word.net
definition: soldier of the American Revolution (1756-1818)
ili: i95925
lexfile: noun.person
part of speech: noun
instance hypernym: 10641415-n

Richard Henry Lee-n
type: LexicalEntry
canonical form: Richard Henry Lee
sense: 11143884-n
part of speech: noun

11143884-n
type: LexicalConcept
in scheme: en-word.net
definition: leader of the American Revolution who proposed the resolution calling for independence of the American Colonies (1732-1794)
ili: i95926
lexfile: noun.person
part of speech: noun
instance hypernym: 09759416-n

Tsung-Dao Lee-n
type: LexicalEntry
canonical form: Tsung-Dao Lee
sense: 11144078-n
part of speech: noun

Tsung Dao Lee-n
type: LexicalEntry
canonical form: Tsung Dao Lee
sense: 11144078-n
part of speech: noun

11144078-n
type: LexicalConcept
in scheme: en-word.net
definition: United States physicist (born in China) who collaborated with Yang Chen Ning in disproving the principle of conservation of parity (born in 1926)
ili: i95927
lexfile: noun.person
part of speech: noun
instance hypernym: 10384342-n

Bruce Lee-n
type: LexicalEntry
canonical form: Bruce Lee
sense: 11144290-n
part of speech: noun

Lee Yuen Kam-n
type: LexicalEntry
canonical form: Lee Yuen Kam
sense: 11144290-n
part of speech: noun

11144290-n
type: LexicalConcept
in scheme: en-word.net
definition: United States actor who was an expert in kung fu and starred in martial arts films (1940-1973)
ili: i95928
lexfile: noun.person
part of speech: noun
instance hypernym: 09784701-n

Gypsy Rose Lee-n
type: LexicalEntry
canonical form: Gypsy Rose Lee
sense: 11144462-n
part of speech: noun

Rose Louise Hovick-n
type: LexicalEntry
canonical form: Rose Louise Hovick
sense: 11144462-n
part of speech: noun

11144462-n
type: LexicalConcept
in scheme: en-word.net
definition: United States striptease artist who became famous on Broadway in the 1930s (1914-1970)
ili: i95929
lexfile: noun.person
part of speech: noun
instance hypernym: 10683779-n

Spike Lee-n
type: LexicalEntry
canonical form: Spike Lee
sense: 11144637-n
part of speech: noun

Shelton Jackson Lee-n
type: LexicalEntry
canonical form: Shelton Jackson Lee
sense: 11144637-n
part of speech: noun

11144637-n
type: LexicalConcept
in scheme: en-word.net
definition: United States filmmaker whose works explore the richness of black culture in America (born in 1957)
ili: i95930
lexfile: noun.person
part of speech: noun
instance hypernym: 10108159-n