Lamentations-n
type: LexicalEntry
canonical form: Lamentations
sense: 06450147-n
part of speech: noun

Book of Lamentations-n
type: LexicalEntry
canonical form: Book of Lamentations
sense: 06450147-n
part of speech: noun

06450147-n
type: LexicalConcept
in scheme: en-word.net
definition: an Old Testament book lamenting the desolation of Judah after the destruction of Jerusalem in 586 BC; traditionally attributed to the prophet Jeremiah
ili: i70320
lexfile: noun.communication
part of speech: noun
instance hypernym: 06406508-n