Corinth-n
type: LexicalEntry
canonical form: Corinth
sense: 08804284-n
part of speech: noun

Korinthos-n
type: LexicalEntry
canonical form: Korinthos
sense: 08804284-n
part of speech: noun

08804284-n
type: LexicalConcept
in scheme: en-word.net
definition: the modern Greek port near the site of the ancient city that was second only to Athens
ili: i83041
lexfile: noun.location
part of speech: noun
instance hypernym: 08542298-n
instance hypernym: 08651532-n
mero member: 09730716-n