Saudi Arabia-n
type: LexicalEntry
canonical form: Saudi Arabia
sense: 09015658-n
part of speech: noun

Kingdom of Saudi Arabia-n
type: LexicalEntry
canonical form: Kingdom of Saudi Arabia
sense: 09015658-n
part of speech: noun

09015658-n
type: LexicalConcept
in scheme: en-word.net
definition: an absolute monarchy occupying most of the Arabian Peninsula in southwest Asia; vast oil reserves dominate the economy
ili: i83946
lexfile: noun.location
part of speech: noun
instance hypernym: 08718069-n
mero member: 09748729-n
mero part: 09016241-n
mero part: 09016460-n
mero part: 09016709-n
mero part: 09016910-n
mero part: 09017204-n
mero part: 09017383-n
mero part: 09017490-n
mero part: 09017612-n
mero part: 09017885-n
mero part: 09194273-n
mero part: 09195008-n
mero part: 09195920-n