Jordan-n
type: LexicalEntry
canonical form: Jordan
sense: 08946959-n
part of speech: noun
sense: 09344807-n

Hashemite Kingdom of Jordan-n
type: LexicalEntry
canonical form: Hashemite Kingdom of Jordan
sense: 08946959-n
part of speech: noun

08946959-n
type: LexicalConcept
in scheme: en-word.net
definition: an Arab kingdom in southwestern Asia on the Red Sea
ili: i83631
lexfile: noun.location
part of speech: noun
instance hypernym: 08718069-n
mero member: 09738207-n
mero part: 08947321-n
mero part: 08947451-n
mero part: 08947856-n
mero part: 09195920-n
mero part: 09286525-n

Jordan River-n
type: LexicalEntry
canonical form: Jordan River
sense: 09344807-n
part of speech: noun

09344807-n
type: LexicalConcept
in scheme: en-word.net
definition: a river in Palestine that empties into the Dead Sea; John the Baptist baptized Jesus in the Jordan
ili: i85611
lexfile: noun.object
part of speech: noun
instance hypernym: 09434308-n