Joplin-n
type: LexicalEntry
canonical form: Joplin
sense: 11111364-n
part of speech: noun
sense: 11111535-n

Scott Joplin-n
type: LexicalEntry
canonical form: Scott Joplin
sense: 11111364-n
part of speech: noun

11111364-n
type: LexicalConcept
in scheme: en-word.net
definition: United States composer who was the first creator of ragtime to write down his compositions (1868-1917)
ili: i95752
lexfile: noun.person
part of speech: noun
instance hypernym: 09966711-n

Janis Joplin-n
type: LexicalEntry
canonical form: Janis Joplin
sense: 11111535-n
part of speech: noun

11111535-n
type: LexicalConcept
in scheme: en-word.net
definition: United States singer who died of a drug overdose at the height of her popularity (1943-1970)
ili: i95753
lexfile: noun.person
part of speech: noun
instance hypernym: 10619214-n