Johns-n
type: LexicalEntry
canonical form: Johns
sense: 11107921-n
part of speech: noun

Jasper Johns-n
type: LexicalEntry
canonical form: Jasper Johns
sense: 11107921-n
part of speech: noun

11107921-n
type: LexicalConcept
in scheme: en-word.net
definition: United States artist and proponent of pop art (born in 1930)
ili: i95734
lexfile: noun.person
part of speech: noun
instance hypernym: 09831743-n