Jay-n
type: LexicalEntry
canonical form: Jay
sense: 11101101-n
part of speech: noun

John Jay-n
type: LexicalEntry
canonical form: John Jay
sense: 11101101-n
part of speech: noun

11101101-n
type: LexicalConcept
in scheme: en-word.net
definition: United States diplomat and jurist who negotiated peace treaties with Britain and served as the first chief justice of the United States Supreme Court (1745-1829)
ili: i95702
lexfile: noun.person
part of speech: noun
instance hypernym: 10033672-n
instance hypernym: 09936246-n