Henson-n
type: LexicalEntry
canonical form: Henson
sense: 11063831-n
part of speech: noun

Jim Henson-n
type: LexicalEntry
canonical form: Jim Henson
sense: 11063831-n
part of speech: noun

11063831-n
type: LexicalConcept
in scheme: en-word.net
definition: United States puppeteer who created a troupe of puppet characters (1936-1990)
ili: i95494
lexfile: noun.person
part of speech: noun
instance hypernym: 10513270-n