Jerez-n
type: LexicalEntry
canonical form: Jerez
sense: 09048574-n
part of speech: noun

Jerez de la Frontera-n
type: LexicalEntry
canonical form: Jerez de la Frontera
sense: 09048574-n
part of speech: noun

09048574-n
type: LexicalConcept
in scheme: en-word.net
definition: a city in southwestern Spain that is famous for making sherry
ili: i84092
lexfile: noun.location
part of speech: noun
instance hypernym: 08542298-n