Illinois-n
type: LexicalEntry
canonical form: Illinois
sense: 06922910-n
part of speech: noun
sense: 09105071-n
sense: 09677320-n

Illinois language-n
type: LexicalEntry
canonical form: Illinois language
sense: 06922910-n
part of speech: noun

06922910-n
type: LexicalConcept
in scheme: en-word.net
definition: the Algonquian language of the Illinois and Miami
ili: i72829
lexfile: noun.communication
part of speech: noun
hypernym: 06919747-n

Prairie State-n
type: LexicalEntry
canonical form: Prairie State
sense: 09105071-n
part of speech: noun

Land of Lincoln-n
type: LexicalEntry
canonical form: Land of Lincoln
sense: 09105071-n
part of speech: noun

IL-n
type: LexicalEntry
canonical form: IL
sense: 09105071-n
part of speech: noun

Ill.-n
type: LexicalEntry
canonical form: Ill.
sense: 09105071-n
part of speech: noun

09105071-n
type: LexicalConcept
in scheme: en-word.net
definition: a midwestern state in north-central United States
ili: i84351
lexfile: noun.location
part of speech: noun
instance hypernym: 08673095-n
mero part: 09105526-n
mero part: 09105689-n
mero part: 09105793-n
mero part: 09105928-n
mero part: 09106197-n
mero part: 09106333-n
mero part: 09106487-n
mero part: 09106613-n
mero part: 09106734-n
mero part: 09106836-n
mero part: 09107021-n
mero part: 09107153-n
mero part: 09333220-n
mero part: 09364051-n

09677320-n
type: LexicalConcept
in scheme: en-word.net
definition: a member of the Algonquian people formerly of Illinois and regions to the west
ili: i87373
lexfile: noun.person
part of speech: noun
hypernym: 09666446-n