Hunt-n
type: LexicalEntry
canonical form: Hunt
sense: 11086762-n
part of speech: noun
sense: 11086928-n
sense: 11087037-n

Leigh Hunt-n
type: LexicalEntry
canonical form: Leigh Hunt
sense: 11086762-n
part of speech: noun

James Henry Leigh Hunt-n
type: LexicalEntry
canonical form: James Henry Leigh Hunt
sense: 11086762-n
part of speech: noun

11086762-n
type: LexicalConcept
in scheme: en-word.net
definition: British writer who defended the Romanticism of Keats and Shelley (1784-1859)
ili: i95624
lexfile: noun.person
part of speech: noun
instance hypernym: 10813654-n

Richard Morris Hunt-n
type: LexicalEntry
canonical form: Richard Morris Hunt
sense: 11086928-n
part of speech: noun

11086928-n
type: LexicalConcept
in scheme: en-word.net
definition: United States architect (1827-1895)
ili: i95625
lexfile: noun.person
part of speech: noun
instance hypernym: 09824898-n

Holman Hunt-n
type: LexicalEntry
canonical form: Holman Hunt
sense: 11087037-n
part of speech: noun

William Holman Hunt-n
type: LexicalEntry
canonical form: William Holman Hunt
sense: 11087037-n
part of speech: noun

11087037-n
type: LexicalConcept
in scheme: en-word.net
definition: Englishman and Pre-Raphaelite painter (1827-1910)
ili: i95626
lexfile: noun.person
part of speech: noun
instance hypernym: 10484814-n