Hong Kong-n
type: LexicalEntry
canonical form: Hong Kong
sense: 08748981-n
part of speech: noun

08748981-n
type: LexicalConcept
in scheme: en-word.net
definition: formerly a Crown Colony on the coast of southern China in Guangdong province; leased by China to Britain in 1842 and returned in 1997; one of the world's leading commercial centers
ili: i82774
lexfile: noun.location
part of speech: noun
instance hypernym: 08542298-n
instance hypernym: 08651532-n