Hinault-n
type: LexicalEntry
canonical form: Hinault
sense: 11070718-n
part of speech: noun

Bernard Hinault-n
type: LexicalEntry
canonical form: Bernard Hinault
sense: 11070718-n
part of speech: noun

11070718-n
type: LexicalConcept
in scheme: en-word.net
definition: French racing cyclist who won the Tour de France five times (born in 1954)
ili: i95533
lexfile: noun.person
part of speech: noun
instance hypernym: 10005719-n