Geiger-n
type: LexicalEntry
canonical form: Geiger
sense: 11013503-n
part of speech: noun

Hans Geiger-n
type: LexicalEntry
canonical form: Hans Geiger
sense: 11013503-n
part of speech: noun

11013503-n
type: LexicalConcept
in scheme: en-word.net
definition: German physicist who developed the Geiger counter (1882-1945)
ili: i95226
lexfile: noun.person
part of speech: noun
instance hypernym: 10447768-n