Hampshire-n
type: LexicalEntry
canonical form: Hampshire
sense: 02416239-n
part of speech: noun
sense: 08902592-n

Hampshire down-n
type: LexicalEntry
canonical form: Hampshire down
sense: 02416239-n
part of speech: noun

02416239-n
type: LexicalConcept
in scheme: en-word.net
definition: British breed of hornless dark-faced domestic sheep
ili: i48305
lexfile: noun.animal
part of speech: noun
hypernym: 02415777-n

08902592-n
type: LexicalConcept
in scheme: en-word.net
definition: a county of southern England on the English Channel
ili: i83426
lexfile: noun.location
part of speech: noun
instance hypernym: 08563758-n
mero part: 08901086-n
mero part: 08902757-n