Gulf of Suez-n
type: LexicalEntry
canonical form: Gulf of Suez
sense: 09322633-n
part of speech: noun

09322633-n
type: LexicalConcept
in scheme: en-word.net
definition: a northwestern arm of the Red Sea linked to the Mediterranean by the Suez Canal
ili: i85504
lexfile: noun.object
part of speech: noun
instance hypernym: 09319027-n