Gulf of Mexico-n
type: LexicalEntry
canonical form: Gulf of Mexico
sense: 09321604-n
part of speech: noun

Golfo de Mexico-n
type: LexicalEntry
canonical form: Golfo de Mexico
sense: 09321604-n
part of speech: noun

09321604-n
type: LexicalConcept
in scheme: en-word.net
definition: an arm of the Atlantic to the south of the United States and to the east of Mexico
ili: i85498
lexfile: noun.object
part of speech: noun
instance hypernym: 09319027-n
mero part: 09309224-n
mero part: 09319601-n
mero part: 09320635-n
mero part: 09379678-n
mero part: 09477395-n