Guam-n
type: LexicalEntry
canonical form: Guam
sense: 08857311-n
part of speech: noun

GU-n
type: LexicalEntry
canonical form: GU
sense: 08857311-n
part of speech: noun

08857311-n
type: LexicalConcept
in scheme: en-word.net
definition: the largest and southernmost island in the Marianas which is administered as a territory of the United States; it was ceded by Spain to the United States in 1898
ili: i83276
lexfile: noun.location
part of speech: noun
instance hypernym: 09339360-n