Gothic-n
type: LexicalEntry
canonical form: Gothic
sense: 06968446-n
part of speech: noun

Gothic language-n
type: LexicalEntry
canonical form: Gothic language
sense: 06968446-n
part of speech: noun

06968446-n
type: LexicalConcept
in scheme: en-word.net
definition: extinct East Germanic language of the ancient Goths; the only surviving record being fragments of a 4th-century translation of the Bible by Bishop Ulfilas
ili: i73152
lexfile: noun.communication
part of speech: noun
hypernym: 06968300-n