Gibson-n
type: LexicalEntry
canonical form: Gibson
sense: 11018113-n
part of speech: noun
sense: 11018301-n
sense: 11018470-n

Althea Gibson-n
type: LexicalEntry
canonical form: Althea Gibson
sense: 11018113-n
part of speech: noun

11018113-n
type: LexicalConcept
in scheme: en-word.net
definition: United States tennis player who was the first Black woman player to win all the major world singles titles (1927-2003)
ili: i95251
lexfile: noun.person
part of speech: noun
instance hypernym: 10720829-n

Mel Gibson-n
type: LexicalEntry
canonical form: Mel Gibson
sense: 11018301-n
part of speech: noun

Mel Columcille Gerard Gibson-n
type: LexicalEntry
canonical form: Mel Columcille Gerard Gibson
sense: 11018301-n
part of speech: noun

11018301-n
type: LexicalConcept
in scheme: en-word.net
definition: Australian actor (born in the United States in 1956)
ili: i95252
lexfile: noun.person
part of speech: noun
domain region: 09067337-n
instance hypernym: 09784701-n

C. D. Gibson-n
type: LexicalEntry
canonical form: C. D. Gibson
sense: 11018470-n
part of speech: noun

Charles Dana Gibson-n
type: LexicalEntry
canonical form: Charles Dana Gibson
sense: 11018470-n
part of speech: noun

11018470-n
type: LexicalConcept
in scheme: en-word.net
definition: United States illustrator remembered for his creation of the ‘Gibson girl’ (1867-1944)
ili: i95253
lexfile: noun.person
part of speech: noun
instance hypernym: 09831473-n