Gettysburg Address-n
type: LexicalEntry
canonical form: Gettysburg Address
sense: 07254210-n
part of speech: noun

07254210-n
type: LexicalConcept
in scheme: en-word.net
definition: a three-minute address by Abraham Lincoln during the American Civil War at the dedication of a national cemetery on the site of the Battle of Gettysburg (November 19, 1863)
ili: i74715
lexfile: noun.communication
part of speech: noun
instance hypernym: 07253354-n