George-n
type: LexicalEntry
canonical form: George
sense: 11016086-n
part of speech: noun

George VI-n
type: LexicalEntry
canonical form: George VI
sense: 11016086-n
part of speech: noun

11016086-n
type: LexicalConcept
in scheme: en-word.net
definition: King of Great Britain and Ireland and emperor of India from 1936 to 1947; he succeeded Edward VIII (1895-1952)
ili: i95239
lexfile: noun.person
part of speech: noun
instance hypernym: 10253142-n