Fox-n
type: LexicalEntry
canonical form: Fox
sense: 10996858-n
part of speech: noun

George Fox-n
type: LexicalEntry
canonical form: George Fox
sense: 10996858-n
part of speech: noun

10996858-n
type: LexicalConcept
in scheme: en-word.net
definition: English religious leader who founded the Society of Friends (1624-1691)
ili: i95141
lexfile: noun.person
part of speech: noun
instance hypernym: 09651570-n