George I of Great Britain-n
type: LexicalEntry
canonical form: George I of Great Britain
sense: 11014902-n
part of speech: noun

George-n
type: LexicalEntry
canonical form: George
sense: 11014902-n
part of speech: noun
sense: 11015111-n
sense: 11015288-n
sense: 11015588-n
sense: 11015846-n
sense: 11016086-n
sense: 11016281-n

George I-n
type: LexicalEntry
canonical form: George I
sense: 11014902-n
part of speech: noun

11014902-n
type: LexicalConcept
in scheme: en-word.net
definition: Elector of Hanover and the first Hanoverian King of Great Britain and Ireland from 1714 to 1727 (1660-1727)
ili: i95234
lexfile: noun.person
part of speech: noun
instance hypernym: 10253142-n

George II of Great Britain-n
type: LexicalEntry
canonical form: George II of Great Britain
sense: 11015111-n
part of speech: noun

George II-n
type: LexicalEntry
canonical form: George II
sense: 11015111-n
part of speech: noun

11015111-n
type: LexicalConcept
in scheme: en-word.net
definition: King of Great Britain and Elector of Hanover from 1727 to 1760 (1683-1760)
ili: i95235
lexfile: noun.person
part of speech: noun
instance hypernym: 10253142-n

George III of the United Kingdom-n
type: LexicalEntry
canonical form: George III of the United Kingdom
sense: 11015288-n
part of speech: noun

George III-n
type: LexicalEntry
canonical form: George III
sense: 11015288-n
part of speech: noun

11015288-n
type: LexicalConcept
in scheme: en-word.net
definition: King of Great Britain and Ireland from 1760 to 1820; the American colonies were lost during his reign; he became insane in 1811 and his son (later George IV) acted as regent until 1820 (1738-1820)
ili: i95236
lexfile: noun.person
part of speech: noun
instance hypernym: 10253142-n

George IV of the United Kingdom-n
type: LexicalEntry
canonical form: George IV of the United Kingdom
sense: 11015588-n
part of speech: noun

George IV-n
type: LexicalEntry
canonical form: George IV
sense: 11015588-n
part of speech: noun

11015588-n
type: LexicalConcept
in scheme: en-word.net
definition: King of Great Britain and Ireland and Hanover from 1820 to 1830; his attempt to divorce his estranged wife undermined the prestige of the Crown (1762-1830)
ili: i95237
lexfile: noun.person
part of speech: noun
instance hypernym: 10253142-n

George V-n
type: LexicalEntry
canonical form: George V
sense: 11015846-n
part of speech: noun

11015846-n
type: LexicalConcept
in scheme: en-word.net
definition: King of Great Britain and Ireland and emperor of India from 1910 to 1936; gave up his German title in 1917 during World War I (1865-1936)
ili: i95238
lexfile: noun.person
part of speech: noun
instance hypernym: 10253142-n

George VI-n
type: LexicalEntry
canonical form: George VI
sense: 11016086-n
part of speech: noun

11016086-n
type: LexicalConcept
in scheme: en-word.net
definition: King of Great Britain and Ireland and emperor of India from 1936 to 1947; he succeeded Edward VIII (1895-1952)
ili: i95239
lexfile: noun.person
part of speech: noun
instance hypernym: 10253142-n

Saint George-n
type: LexicalEntry
canonical form: Saint George
sense: 11016281-n
part of speech: noun

St. George-n
type: LexicalEntry
canonical form: St. George
sense: 11016281-n
part of speech: noun

11016281-n
type: LexicalConcept
in scheme: en-word.net
definition: Christian martyr; patron saint of England; hero of the legend of Saint George and the Dragon in which he slew a dragon and saved a princess (?-303)
ili: i95240
lexfile: noun.person
part of speech: noun
instance hypernym: 10316493-n
instance hypernym: 10428297-n