Lipmann-n
type: LexicalEntry
canonical form: Lipmann
sense: 11153928-n
part of speech: noun

Fritz Albert Lipmann-n
type: LexicalEntry
canonical form: Fritz Albert Lipmann
sense: 11153928-n
part of speech: noun

11153928-n
type: LexicalConcept
in scheme: en-word.net
definition: United States biochemist (born in Germany) noted for his studies of metabolic processes (1899-1986)
ili: i95979
lexfile: noun.person
part of speech: noun
instance hypernym: 09874321-n