Franck-n
type: LexicalEntry
canonical form: Franck
sense: 10998418-n
part of speech: noun
sense: 10998689-n

James Franck-n
type: LexicalEntry
canonical form: James Franck
sense: 10998418-n
part of speech: noun

10998418-n
type: LexicalConcept
in scheme: en-word.net
definition:
  value: United States physicist (born in Germany) who with Gustav Hertz performed an electron scattering experiment that proved the existence of the stationary energy states postulated by Niels Bohr (1882-1964)
ili: i95149
lexfile: noun.person
part of speech: noun
instance hypernym: 10447768-n

Cesar Franck-n
type: LexicalEntry
canonical form: Cesar Franck
sense: 10998689-n
part of speech: noun

10998689-n
type: LexicalConcept
in scheme: en-word.net
definition: French composer and teacher who influenced a generation of composers (1822-1890)
ili: i95150
lexfile: noun.person
part of speech: noun
instance hypernym: 09966711-n