Fonda-n
type: LexicalEntry
canonical form: Fonda
sense: 10994025-n
part of speech: noun
sense: 10994128-n

Henry Fonda-n
type: LexicalEntry
canonical form: Henry Fonda
sense: 10994025-n
part of speech: noun

10994025-n
type: LexicalConcept
in scheme: en-word.net
definition: United States film actor (1905-1982)
ili: i95124
lexfile: noun.person
part of speech: noun
instance hypernym: 09784701-n

Jane Fonda-n
type: LexicalEntry
canonical form: Jane Fonda
sense: 10994128-n
part of speech: noun

10994128-n
type: LexicalConcept
in scheme: en-word.net
definition: United States film actress and daughter of Henry Fonda (born in 1937)
ili: i95125
lexfile: noun.person
part of speech: noun
instance hypernym: 09787123-n