Lippi-n
type: LexicalEntry
canonical form: Lippi
sense: 11154329-n
part of speech: noun

Filippino Lippi-n
type: LexicalEntry
canonical form: Filippino Lippi
sense: 11154329-n
part of speech: noun

11154329-n
type: LexicalConcept
in scheme: en-word.net
definition: Italian painter and son of Fra Filippo Lippi (1457-1504)
ili: i95982
lexfile: noun.person
part of speech: noun
instance hypernym: 10395493-n