Esperanto-n
type: LexicalEntry
canonical form: Esperanto
sense: 06908812-n
part of speech: noun

06908812-n
type: LexicalConcept
in scheme: en-word.net
definition: an artificial language based as far as possible on words common to all the European languages
ili: i72740
lexfile: noun.communication
part of speech: noun
hypernym: 06907583-n