Robinson-n
type: LexicalEntry
canonical form: Robinson
sense: 11285581-n
part of speech: noun

Edwin Arlington Robinson-n
type: LexicalEntry
canonical form: Edwin Arlington Robinson
sense: 11285581-n
part of speech: noun

11285581-n
type: LexicalConcept
in scheme: en-word.net
definition: United States poet; author of narrative verse (1869-1935)
ili: i96729
lexfile: noun.person
part of speech: noun
instance hypernym: 10463768-n