Stewart-n
type: LexicalEntry
canonical form: Stewart
sense: 11338034-n
part of speech: noun

Dugald Stewart-n
type: LexicalEntry
canonical form: Dugald Stewart
sense: 11338034-n
part of speech: noun

11338034-n
type: LexicalConcept
in scheme: en-word.net
definition: Scottish philosopher and follower of Thomas Reid (1753-1828)
ili: i97021
lexfile: noun.person
part of speech: noun
instance hypernym: 10443334-n