Diderot-n
type: LexicalEntry
canonical form: Diderot
sense: 10954509-n
part of speech: noun

Denis Diderot-n
type: LexicalEntry
canonical form: Denis Diderot
sense: 10954509-n
part of speech: noun

10954509-n
type: LexicalConcept
in scheme: en-word.net
definition: French philosopher who was a leading figure of the Enlightenment in France; principal editor of an encyclopedia that disseminated the scientific and philosophical knowledge of the time (1713-1784)
ili: i94920
lexfile: noun.person
part of speech: noun
instance hypernym: 10443334-n