French-n
type: LexicalEntry
canonical form: French
sense: 11001746-n
part of speech: noun

Daniel Chester French-n
type: LexicalEntry
canonical form: Daniel Chester French
sense: 11001746-n
part of speech: noun

11001746-n
type: LexicalConcept
in scheme: en-word.net
definition: United States sculptor who created the seated marble figure of Abraham Lincoln in the Lincoln Memorial in Washington D.C. (1850-1931)
ili: i95165
lexfile: noun.person
part of speech: noun
instance hypernym: 10585500-n