Connecticut-n
type: LexicalEntry
canonical form: Connecticut
sense: 09090929-n
part of speech: noun
sense: 09091296-n
sense: 09275179-n

Nutmeg State-n
type: LexicalEntry
canonical form: Nutmeg State
sense: 09090929-n
part of speech: noun

Constitution State-n
type: LexicalEntry
canonical form: Constitution State
sense: 09090929-n
part of speech: noun

CT-n
type: LexicalEntry
canonical form: CT
sense: 09090929-n
part of speech: noun

Ct.-n
type: LexicalEntry
canonical form: Ct.
sense: 09090929-n
part of speech: noun

09090929-n
type: LexicalConcept
in scheme: en-word.net
definition: a New England state; one of the original 13 colonies
ili: i84276
lexfile: noun.location
part of speech: noun
instance hypernym: 08673095-n
mero part: 09091412-n
mero part: 09091563-n
mero part: 09091681-n
mero part: 09091906-n
mero part: 09092060-n
mero part: 09092243-n
mero part: 09328937-n
mero part: 09366328-n
mero part: 09476418-n

09091296-n
type: LexicalConcept
in scheme: en-word.net
definition: one of the British colonies that formed the United States, with capital Hartford or Hartford and New Haven
ili: i84277
lexfile: noun.location
part of speech: noun
instance hypernym: 09070916-n

Connecticut River-n
type: LexicalEntry
canonical form: Connecticut River
sense: 09275179-n
part of speech: noun

09275179-n
type: LexicalConcept
in scheme: en-word.net
definition:
  value: a river in the northeastern United States; flows south from northern New Hampshire along the border between New Hampshire and Vermont and through Massachusetts and Connecticut where it empties into Long Island Sound
ili: i85249
lexfile: noun.object
part of speech: noun
instance hypernym: 09434308-n