Coney Island-n
type: LexicalEntry
canonical form: Coney Island
sense: 09142874-n
part of speech: noun

09142874-n
type: LexicalConcept
in scheme: en-word.net
definition: a section of Brooklyn on the Atlantic; known as an amusement center
ili: i84555
lexfile: noun.location
part of speech: noun
instance hypernym: 08555400-n