Churchill-n
type: LexicalEntry
canonical form: Churchill
sense: 08843315-n
part of speech: noun
sense: 10917064-n
sense: 10917346-n

08843315-n
type: LexicalConcept
in scheme: en-word.net
definition: a Canadian town in northern Manitoba on Hudson Bay; important port for shipping grain
ili: i83208
lexfile: noun.location
part of speech: noun
instance hypernym: 08683242-n

Winston Churchill-n
type: LexicalEntry
canonical form: Winston Churchill
sense: 10917064-n
part of speech: noun

Winston S. Churchill-n
type: LexicalEntry
canonical form: Winston S. Churchill
sense: 10917064-n
part of speech: noun

Sir Winston Leonard Spencer Churchill-n
type: LexicalEntry
canonical form: Sir Winston Leonard Spencer Churchill
sense: 10917064-n
part of speech: noun

10917064-n
type: LexicalConcept
in scheme: en-word.net
definition: British statesman and leader during World War II; received Nobel prize for literature in 1953 (1874-1965)
ili: i94723
lexfile: noun.person
part of speech: noun
instance hypernym: 10669601-n
instance hypernym: 10813654-n

John Churchill-n
type: LexicalEntry
canonical form: John Churchill
sense: 10917346-n
part of speech: noun

Duke of Marlborough-n
type: LexicalEntry
canonical form: Duke of Marlborough
sense: 10917346-n
part of speech: noun

First Duke of Marlborough-n
type: LexicalEntry
canonical form: First Duke of Marlborough
sense: 10917346-n
part of speech: noun

10917346-n
type: LexicalConcept
in scheme: en-word.net
definition: English general considered one of the greatest generals in history (1650-1722)
ili: i94724
lexfile: noun.person
part of speech: noun
instance hypernym: 10143381-n