Charles-n
type: LexicalEntry
canonical form: Charles
sense: 09264943-n
part of speech: noun
sense: 10911733-n
sense: 10911970-n
sense: 10912168-n
sense: 10912316-n
sense: 10912538-n
sense: 10912699-n
sense: 10912905-n
sense: 10913185-n

Charles River-n
type: LexicalEntry
canonical form: Charles River
sense: 09264943-n
part of speech: noun

09264943-n
type: LexicalConcept
in scheme: en-word.net
definition: a river in eastern Massachusetts that empties into Boston Harbor and that separates Cambridge from Boston
ili: i85195
lexfile: noun.object
part of speech: noun
instance hypernym: 09434308-n

Charlemagne-n
type: LexicalEntry
canonical form: Charlemagne
sense: 10911733-n
part of speech: noun

Carolus-n
type: LexicalEntry
canonical form: Carolus
sense: 10911733-n
part of speech: noun

Charles I-n
type: LexicalEntry
canonical form: Charles I
sense: 10911733-n
part of speech: noun
sense: 10912316-n
sense: 10912699-n

Charles the Great-n
type: LexicalEntry
canonical form: Charles the Great
sense: 10911733-n
part of speech: noun

10911733-n
type: LexicalConcept
in scheme: en-word.net
definition: king of the Franks and Holy Roman Emperor; conqueror of the Lombards and Saxons (742-814)
ili: i94696
lexfile: noun.person
part of speech: noun
instance hypernym: 10200768-n
instance hypernym: 09915972-n

Jacques Charles-n
type: LexicalEntry
canonical form: Jacques Charles
sense: 10911970-n
part of speech: noun

Jacques Alexandre Cesar Charles-n
type: LexicalEntry
canonical form: Jacques Alexandre Cesar Charles
sense: 10911970-n
part of speech: noun

10911970-n
type: LexicalConcept
in scheme: en-word.net
definition: French physicist and author of Charles's law which anticipated Gay-Lussac's law (1746-1823)
ili: i94697
lexfile: noun.person
part of speech: noun
instance hypernym: 10447768-n

Prince Charles-n
type: LexicalEntry
canonical form: Prince Charles
sense: 10912168-n
part of speech: noun

Charles III-n
type: LexicalEntry
canonical form: Charles III
sense: 10912168-n
part of speech: noun

Charles III of England-n
type: LexicalEntry
canonical form: Charles III of England
sense: 10912168-n
part of speech: noun

10912168-n
type: LexicalConcept
in scheme: en-word.net
definition: the eldest son of Elizabeth II and king of the United Kingdom since 2022 (born in 1948)
ili: i94698
lexfile: noun.person
part of speech: noun
instance hypernym: 10493502-n
instance hypernym: 10253142-n

Charles I of England-n
type: LexicalEntry
canonical form: Charles I of England
sense: 10912316-n
part of speech: noun

Charles Stuart-n
type: LexicalEntry
canonical form: Charles Stuart
sense: 10912316-n
part of speech: noun

10912316-n
type: LexicalConcept
in scheme: en-word.net
definition: son of James I who was King of England and Scotland and Ireland; was deposed and executed by Oliver Cromwell (1600-1649)
ili: i94699
lexfile: noun.person
part of speech: noun
instance hypernym: 10253142-n

Charles II of England-n
type: LexicalEntry
canonical form: Charles II of England
sense: 10912538-n
part of speech: noun

Charles II-n
type: LexicalEntry
canonical form: Charles II
sense: 10912538-n
part of speech: noun
sense: 10912699-n

10912538-n
type: LexicalConcept
in scheme: en-word.net
definition: King of England and Scotland and Ireland during the Restoration (1630-1685)
ili: i94700
lexfile: noun.person
part of speech: noun
instance hypernym: 10253142-n

Charles the Bald-n
type: LexicalEntry
canonical form: Charles the Bald
sense: 10912699-n
part of speech: noun

10912699-n
type: LexicalConcept
in scheme: en-word.net
definition: as Charles II he was Holy Roman Emperor and as Charles I he was king of France (823-877)
ili: i94701
lexfile: noun.person
part of speech: noun
instance hypernym: 10200768-n
instance hypernym: 10254037-n

Charles VII of France-n
type: LexicalEntry
canonical form: Charles VII of France
sense: 10912905-n
part of speech: noun

Charles VII-n
type: LexicalEntry
canonical form: Charles VII
sense: 10912905-n
part of speech: noun

10912905-n
type: LexicalConcept
in scheme: en-word.net
definition:
  value: King of France who began his reign with most of northern France under English control; after the intervention of Jeanne d'Arc the French were able to defeat the English and end the Hundred Years' War (1403-1461)
ili: i94702
lexfile: noun.person
part of speech: noun
instance hypernym: 10254037-n

Charles IX of France-n
type: LexicalEntry
canonical form: Charles IX of France
sense: 10913185-n
part of speech: noun

Charles IX-n
type: LexicalEntry
canonical form: Charles IX
sense: 10913185-n
part of speech: noun

10913185-n
type: LexicalConcept
in scheme: en-word.net
definition: King of France from 1560 to 1574 whose reign was dominated by his mother Catherine de Medicis (1550-1574)
ili: i94703
lexfile: noun.person
part of speech: noun
instance hypernym: 10254037-n