Catherine of Aragon-n
type: LexicalEntry
canonical form: Catherine of Aragon
sense: 10907345-n
part of speech: noun

Catherine-n
type: LexicalEntry
canonical form: Catherine
sense: 10907345-n
part of speech: noun

10907345-n
type: LexicalConcept
in scheme: en-word.net
definition: first wife of Henry VIII; Henry VIII's divorce from her was the initial step of the Reformation in England (1485-1536)
ili: i94673
lexfile: noun.person
part of speech: noun
instance hypernym: 10800308-n